Я получаю массу сообщений об ошибках, когда пытаюсь установить node_modules в моем проекте. Ранее я успешно установил его, но я не уверен, что сделал неправильно, чтобы все эти сообщения об ошибках теперь генерировались.
Любая помощь в расшифровке того, что они имеют в виду, была бы великолепна. Перед этим я установил grpc, который установил v1.14.1:
$ npm install -g grpc@latest
grpc@1.14.1 install /usr/local/lib/node_modules/grpc
node-pre-gyp install --fallback-to-build --library=static_library
node-pre-gyp WARN Using needle for node-pre-gyp https download
[grpc] Success: "/usr/local/lib/node_modules/grpc/src/node/extension_binary/node-v64-darwin-x64-unknown/grpc_node.node" is installed via remote
+ grpc@1.14.1
added 85 packages from 48 contributors in 6.344s
, поэтому любопытно, почему узел пытается использовать v1.10.1 в следующих сообщениях:
$ npm i
> fsevents@1.2.4 install /path/to/app/node_modules/fsevents
> node install
[fsevents] Success: "/path/to/app/node_modules/fsevents/lib/binding/Release/node-v64-darwin-x64/fse.node" already installed
Pass --update-binary to reinstall or --build-from-source to recompile
> grpc@1.10.1 install /path/to/app/node_modules/@firebase/firestore/node_modules/grpc
> node-pre-gyp install --fallback-to-build --library=static_library
node-pre-gyp ERR! Tried to download(403): https://storage.googleapis.com/grpc-precompiled-binaries/node/grpc/v1.10.1/node-v64-darwin-x64-unknown.tar.gz
node-pre-gyp ERR! Pre-built binaries not found for grpc@1.10.1 and node@10.9.0 (node-v64 ABI, unknown) (falling back to source compile with node-gyp)
node-pre-gyp ERR! Pre-built binaries not installable for grpc@1.10.1 and node@10.9.0 (node-v64 ABI, unknown) (falling back to source compile with node-gyp)
node-pre-gyp ERR! Hit error Connection closed while downloading tarball file
CXX(target) Release/obj.target/grpc/deps/grpc/src/core/lib/surface/init.o
CXX(target) Release/obj.target/grpc/deps/grpc/src/core/lib/surface/init.o
sed: ./Release/.deps/Release/obj.target/grpc/deps/grpc/src/core/lib/surface/init.o.d.raw: No such file or directory
CXX(target) Release/obj.target/grpc/deps/grpc/src/core/lib/avl/avl.o
rm: ./Release/.deps/Release/obj.target/grpc/deps/grpc/src/core/lib/surface/init.o.d.raw: No such file or directory
make: *** [Release/obj.target/grpc/deps/grpc/src/core/lib/surface/init.o] Error 1
gyp ERR! build error
gyp ERR! stack Error: `make` failed with exit code: 2
gyp ERR! stack at ChildProcess.onExit (/usr/local/lib/node_modules/npm/node_modules/node-gyp/lib/build.js:262:23)
gyp ERR! stack at ChildProcess.emit (events.js:182:13)
gyp ERR! stack at Process.ChildProcess._handle.onexit (internal/child_process.js:239:12)
gyp ERR! System Darwin 17.7.0
gyp ERR! command "/usr/local/Cellar/node/10.9.0/bin/node" "/usr/local/lib/node_modules/npm/node_modules/node-gyp/bin/node-gyp.js" "build" "--fallback-to-build" "--library=static_library" "--module=/path/to/app/node_modules/@firebase/firestore/node_modules/grpc/src/node/extension_binary/node-v64-darwin-x64-unknown/grpc_node.node" "--module_name=grpc_node" "--module_path=/path/to/app/node_modules/@firebase/firestore/node_modules/grpc/src/node/extension_binary/node-v64-darwin-x64-unknown"
gyp ERR! cwd /path/to/app/node_modules/@firebase/firestore/node_modules/grpc
gyp ERR! node -v v10.9.0
gyp ERR! node-gyp -v v3.7.0
gyp ERR! not ok
node-pre-gyp ERR! build error
node-pre-gyp ERR! stack Error: Failed to execute '/usr/local/Cellar/node/10.9.0/bin/node /usr/local/lib/node_modules/npm/node_modules/node-gyp/bin/node-gyp.js build --fallback-to-build --library=static_library --module=/path/to/app/node_modules/@firebase/firestore/node_modules/grpc/src/node/extension_binary/node-v64-darwin-x64-unknown/grpc_node.node --module_name=grpc_node --module_path=/path/to/app/node_modules/@firebase/firestore/node_modules/grpc/src/node/extension_binary/node-v64-darwin-x64-unknown' (1)
node-pre-gyp ERR! stack at ChildProcess.<anonymous> (/path/to/app/node_modules/@firebase/firestore/node_modules/grpc/node_modules/node-pre-gyp/lib/util/compile.js:83:29)
node-pre-gyp ERR! stack at ChildProcess.emit (events.js:182:13)
node-pre-gyp ERR! stack at maybeClose (internal/child_process.js:961:16)
node-pre-gyp ERR! stack at Process.ChildProcess._handle.onexit (internal/child_process.js:250:5)
node-pre-gyp ERR! System Darwin 17.7.0
node-pre-gyp ERR! command "/usr/local/Cellar/node/10.9.0/bin/node" "/path/to/app/node_modules/@firebase/firestore/node_modules/grpc/node_modules/.bin/node-pre-gyp" "install" "--fallback-to-build" "--library=static_library"
node-pre-gyp ERR! cwd /path/to/app/node_modules/@firebase/firestore/node_modules/grpc
node-pre-gyp ERR! node -v v10.9.0
node-pre-gyp ERR! node-pre-gyp -v v0.7.0
node-pre-gyp ERR! not ok
Failed to execute '/usr/local/Cellar/node/10.9.0/bin/node /usr/local/lib/node_modules/npm/node_modules/node-gyp/bin/node-gyp.js build --fallback-to-build --library=static_library --module=/path/to/app/node_modules/@firebase/firestore/node_modules/grpc/src/node/extension_binary/node-v64-darwin-x64-unknown/grpc_node.node --module_name=grpc_node --module_path=/path/to/app/node_modules/@firebase/firestore/node_modules/grpc/src/node/extension_binary/node-v64-darwin-x64-unknown' (1)
CXX(target) Release/obj.target/grpc/deps/grpc/src/core/lib/backoff/backoff.oexec install script
CXX(target) Release/obj.target/grpc/deps/grpc/src/core/lib/channel/channel_args.oinstall script
error: error reading '../deps/grpc/src/core/lib/channel/channel_args.cc'
1 error generated.
make: *** [Release/obj.target/grpc/deps/grpc/src/core/lib/channel/channel_args.o] Error 1
gyp ERR! build error
gyp ERR! stack Error: `make` failed with exit code: 2
gyp ERR! stack at ChildProcess.onExit (/usr/local/lib/node_modules/npm/node_modules/node-gyp/lib/build.js:262:23)
gyp ERR! stack at ChildProcess.emit (events.js:182:13)
gyp ERR! stack at Process.ChildProcess._handle.onexit (internal/child_process.js:239:12)
gyp ERR! System Darwin 17.7.0l: info lifecycle grpc@1.10.1~install: Failed to exec install script
gyp ERR! command "/usr/local/Cellar/node/10.9.0/bin/node" "/usr/local/lib/node_modules/npm/node_modules/node-gyp/bin/node-gyp.js" "build" "--fallback-to-build" "--library=static_library" "--module=/path/to/app/node_modules/@firebase/firestore/node_modules/grpc/src/node/extension_binary/node-v64-darwin-x64-unknown/grpc_node.node" "--module_name=grpc_node" "--module_path=/path/to/app/node_modules/@firebase/firestore/node_modules/grpc/src/node/extension_binary/node-v64-darwin-x64-unknown"
gyp ERR! cwd /path/to/app/node_modules/@firebase/firestore/node_modules/grpc
gyp ERR! node -v v10.9.0
gyp ERR! node-gyp -v v3.7.0
gyp ERR! not ok
npm ERR! code ELIFECYCLE
npm ERR! errno 1
npm ERR! grpc@1.10.1 install: `node-pre-gyp install --fallback-to-build --library=static_library`
npm ERR! Exit status 1
npm ERR!
npm ERR! Failed at the grpc@1.10.1 install script.
npm ERR! This is probably not a problem with npm. There is likely additional logging output above.
npm ERR! A complete log of this run can be found in:
npm ERR! /Users/myfolder/.npm/_logs/2018-09-03T16_54_49_177Z-debug.log