Я пытаюсь собрать только модуль искрового сердечника. Я запускаю следующую команду:
build/mvn package -DskipTests -pl core
документ
Однако я получаю следующую ошибку:
[INFO] ------------------------------------------------------------------------
[INFO] BUILD FAILURE
[INFO] ------------------------------------------------------------------------
[INFO] Total time: 50.209 s
[INFO] Finished at: 2019-03-23T11:05:52+01:00
[INFO] ------------------------------------------------------------------------
[ERROR] Failed to execute goal net.alchim31.maven:scala-maven-plugin:3.2.2:compile (scala-compile-first) on project spark-core_2.11: Execution scala-compile-first of goal net.alchim31.maven:scala-maven-plugin:3.2.2:compile failed.: CompileFailed -> [Help 1]
[ERROR]
[ERROR] To see the full stack trace of the errors, re-run Maven with the -e switch.
[ERROR] Re-run Maven using the -X switch to enable full debug logging.
[ERROR]
[ERROR] For more information about the errors and possible solutions, please read the following articles:
[ERROR] [Help 1] http://cwiki.apache.org/confluence/display/MAVEN/PluginExecutionException
/.../spark/build/zinc-0.3.15/bin/nailgun: line 50: /.../spark/build/zinc-0.3.15/bin/ng/linux32/ng: cannot execute binary file: Exec format error
Я прочитал, что цинк нужно убить, поэтому я попробовал команду отключения
build/zinc-<version>/bin/zinc -shutdown
документ
но это приводит к той же ошибке:
/.../spark/build/zinc-0.3.15/bin/nailgun: line 50: /.../spark/build/zinc-0.3.15/bin/ng/linux32/ng: cannot execute binary file: Exec format error
Я попытался убить его вручную (kill -9 <pid of zinc from ps -ef>
), а затем повторно запустить сборку mvn, но это привело к той же ошибке.
Я работаю на машине с Ubuntu. Любая информация будет очень признательна. Спасибо!