, когда я запускаю свой проект с assemblyDebug , я получаю эту ошибку
:app:mergeDebugResources
C:\Users\Deepan\Downloads\googleads-mobile-android-examples-
master\googleads-mobile-android-examples-master\java\admob\NativeAdvancedExample\app\build\intermediates\incremental\mergeDebugResources\merged.dir\values-sw600dp-v13\values-sw600dp-v13.xml: error: file not found.
Error: java.util.concurrent.ExecutionException: com.android.builder.internal.aapt.v2.Aapt2Exception: AAPT2 error: check logs for details
:app:mergeDebugResources FAILED
FAILURE: Build failed with an exception.
* What went wrong:
Execution failed for task ':app:mergeDebugResources'.
> Error: java.util.concurrent.ExecutionException: com.android.builder.internal.aapt.v2.Aapt2Exception: AAPT2 error: check logs for details