Gradle Build не удалось в Jhipster - PullRequest
       27

Gradle Build не удалось в Jhipster

1 голос
/ 18 января 2020

Я хочу построить свой проект в jhipster, но теперь я получил эту ошибку (я недавно установил jdk 13). моя IDE: VISUAL STUDIO **

у кого-нибудь есть идея?

FAILURE: сборка не удалась с исключением.

  • Где: файл сборки /Users/bensalemwassim/Desktop/TAC-PROJECT/tour-area-calculation/build.gradle

  • Что пошло не так:

 startup failed:
 General error during semantic analysis: Unsupported class file major version 57

 `java.lang.IllegalArgumentException: Unsupported class file major version 57
     at groovyjarjarasm.asm.ClassReader.<init>(ClassReader.java:184)
     at groovyjarjarasm.asm.ClassReader.<init>(ClassReader.java:166)
      (...)

   at java.base/java.lang.Thread.run(Thread.java:830)`

  1 error


* Try:
Run with --stacktrace option to get the stack trace. Run with --info or --debug option to get more log output. Run with --scan to get full insights.

* Get more help at https://help.gradle.org

BUILD FAILED in 1s
...