Я пытаюсь собрать memcached
на Windows.Вот что я получаю:
$ make
make all-recursive
make[1]: Entering directory `/cygdrive/d/Project Storage/adam/memcached-1.4.6'
Making all in doc
make[2]: Entering directory `/cygdrive/d/Project Storage/adam/memcached-1.4.6/doc'
make all-am
make[3]: Entering directory `/cygdrive/d/Project Storage/adam/memcached-1.4.6/doc'
make[3]: Nothing to be done for `all-am'.
make[3]: Leaving directory `/cygdrive/d/Project Storage/adam/memcached-1.4.6/doc'
make[2]: Leaving directory `/cygdrive/d/Project Storage/adam/memcached-1.4.6/doc'
make[2]: Entering directory `/cygdrive/d/Project Storage/adam/memcached-1.4.6'
gcc -std=gnu99 -DHAVE_CONFIG_H -I. -DNDEBUG -I/usr/local/include -g -O2 -pthread -Wall -Werror -pedantic -Wmissing-prototypes -Wmissing-declaration
s -Wredundant-decls -MT memcached-memcached.o -MD -MP -MF .deps/memcached-memcached.Tpo -c -o memcached-memcached.o `test -f 'memcached.c' || echo './
'`memcached.c
gcc: unrecognized option '-pthread'
cc1: warnings being treated as errors
memcached.c: In function `sanitycheck':
memcached.c:4361: error: array subscript has type `char'
make[2]: *** [memcached-memcached.o] Error 1
make[2]: Leaving directory `/cygdrive/d/Project Storage/adam/memcached-1.4.6'
make[1]: *** [all-recursive] Error 1
make[1]: Leaving directory `/cygdrive/d/Project Storage/adam/memcached-1.4.6'
Есть что-то, что я пропустил?